Reaction Details
TargetPlatelet-derived growth factor receptor beta
LigandBDBM139543
Substrate/Competitorn/a
Meas. Tech.Kinase Assay
pH7.4±n/a
IC50 116±n/a nM
Commentsextracted
Citation Hull, III, CEMalone, TC Kinase inhibitors US Patent US8889870 Publication Date 11/18/2014
 
Platelet-derived growth factor receptor beta
Name:Platelet-derived growth factor receptor beta
Type:Enzyme
Mol. Mass.:123922.25
Organism:Homo sapiens (Human)
Description:P09619
Residue:1106
BDBM139543
NameBDBM139543
Synonyms:US8889870, 3 US9820989, 3
TypeSmall organic molecule
Emp. Form.C21H21N5O
Mol. Mass.359.4243
SMILESCc1cccc(NC(=O)c2cccc(c2)N2CCc3nc(N)ncc3C2)c1