Reaction Details
TargetPlatelet-derived growth factor receptor beta
LigandBDBM139558
Substrate/Competitorn/a
Meas. Tech.Kinase Assay
pH7.4±n/a
IC50 602±n/a nM
Commentsextracted
Citation Hull, III, CEMalone, TC Kinase inhibitors US Patent US8889870 Publication Date 11/18/2014
 
Platelet-derived growth factor receptor beta
Name:Platelet-derived growth factor receptor beta
Type:Enzyme
Mol. Mass.:123922.25
Organism:Homo sapiens (Human)
Description:P09619
Residue:1106
BDBM139558
NameBDBM139558
Synonyms:US8889870, 18 US9820989, 18
TypeSmall organic molecule
Emp. Form.C21H27N5O
Mol. Mass.365.472
SMILESNc1ncc2CN(CCc2n1)c1cccc(c1)C(=O)NCC1CCCCC1