Reaction Details
TargetPlatelet-derived growth factor receptor beta
LigandBDBM139568
Substrate/Competitorn/a
Meas. Tech.Kinase Assay
pH7.4±n/a
IC50>10000±n/a nM
Commentsextracted
Citation Hull, III, CEMalone, TC Kinase inhibitors US Patent US8889870 Publication Date 11/18/2014
 
Platelet-derived growth factor receptor beta
Name:Platelet-derived growth factor receptor beta
Type:Enzyme
Mol. Mass.:123922.25
Organism:Homo sapiens (Human)
Description:P09619
Residue:1106
BDBM139568
NameBDBM139568
Synonyms:US8889870, 37 US9820989, 37
TypeSmall organic molecule
Emp. Form.C20H20N6O
Mol. Mass.360.4124
SMILESCc1cccc(NC(=O)c2cccc(n2)N2CCc3nc(N)ncc3C2)c1