Reaction Details
TargetPlatelet-derived growth factor receptor beta
LigandBDBM139616
Substrate/Competitorn/a
Meas. Tech.Kinase Assay
pH7.4±n/a
IC50>10000±n/a nM
Commentsextracted
Citation Hull, III, CEMalone, TC Kinase inhibitors US Patent US8889870 Publication Date 11/18/2014
 
Platelet-derived growth factor receptor beta
Name:Platelet-derived growth factor receptor beta
Type:Enzyme
Mol. Mass.:123922.25
Organism:Homo sapiens (Human)
Description:P09619
Residue:1106
BDBM139616
NameBDBM139616
Synonyms:US8889870, 164 US9820989, 164
TypeSmall organic molecule
Emp. Form.C21H20N4O
Mol. Mass.344.4097
SMILESO=C(Nc1ccccc1)Nc1ccc(cc1)N1CCc2ccncc2C1