Reaction Details
TargetPlatelet-derived growth factor receptor beta
LigandBDBM139619
Substrate/Competitorn/a
Meas. Tech.Kinase Assay
pH7.4±n/a
IC50 1050±n/a nM
Commentsextracted
Citation Hull, III, CEMalone, TC Kinase inhibitors US Patent US8889870 Publication Date 11/18/2014
 
Platelet-derived growth factor receptor beta
Name:Platelet-derived growth factor receptor beta
Type:Enzyme
Mol. Mass.:123922.25
Organism:Homo sapiens (Human)
Description:P09619
Residue:1106
BDBM139619
NameBDBM139619
Synonyms:US8889870, 167 US9820989, 167
TypeSmall organic molecule
Emp. Form.C23H24N4O
Mol. Mass.372.4629
SMILESCc1cccc(NC(=O)Nc2ccc(cc2C)N2CCc3ccncc3C2)c1