Reaction Details
TargetPhosphatidylinositol 4,5-bisphosphate 3-kinase catalytic subunit beta isoform
LigandBDBM139737
Substrate/Competitorn/a
Meas. Tech.HTRF Assay
IC50 4.74±n/a nM
Citation Scott, WJLiu, NMöwes, MHägebarth, AMönning, UBömer, U Aminoalcohol substituted 2,3-dihydroimidazo[1,2-c]quinazoline derivatives useful for treating hyper-proliferative disorders and diseases associated with angiogenesis US Patent US8895549 Publication Date 11/25/2014
 
Phosphatidylinositol 4,5-bisphosphate 3-kinase catalytic subunit beta isoform
Name:Phosphatidylinositol 4,5-bisphosphate 3-kinase catalytic subunit beta isoform
Type:Enzyme Subunit
Mol. Mass.:122769.00
Organism:Homo sapiens (Human)
Description:P42338
Residue:1070
BDBM139737
NameBDBM139737
Synonyms:US8895549, 12
TypeSmall organic molecule
Emp. Form.C26H34N6O4
Mol. Mass.494.586
SMILESCOc1c(OC[C@H](O)CN(C(C)C)C(C)C)ccc2C3=NCCN3C(NC(=O)c3cccnc3)=Nc12