Reaction Details
TargetPhosphatidylinositol 4,5-bisphosphate 3-kinase catalytic subunit beta isoform
LigandBDBM139732
Substrate/Competitorn/a
Meas. Tech.HTRF Assay
IC50 7.21±n/a nM
Citation Scott, WJLiu, NMöwes, MHägebarth, AMönning, UBömer, U Aminoalcohol substituted 2,3-dihydroimidazo[1,2-c]quinazoline derivatives useful for treating hyper-proliferative disorders and diseases associated with angiogenesis US Patent US8895549 Publication Date 11/25/2014
 
Phosphatidylinositol 4,5-bisphosphate 3-kinase catalytic subunit beta isoform
Name:Phosphatidylinositol 4,5-bisphosphate 3-kinase catalytic subunit beta isoform
Type:Enzyme Subunit
Mol. Mass.:122769.00
Organism:Homo sapiens (Human)
Description:P42338
Residue:1070
BDBM139732
NameBDBM139732
Synonyms:US8895549, 34
TypeSmall organic molecule
Emp. Form.C24H30N6O5S
Mol. Mass.514.597
SMILESCOc1c(OC[C@H](O)CN2C[C@H](C)O[C@H](C)C2)ccc2C3=NCCN3C(NC(=O)c3cncs3)=Nc12