Reaction Details
TargetPhosphatidylinositol 4,5-bisphosphate 3-kinase catalytic subunit beta isoform
LigandBDBM139748
Substrate/Competitorn/a
Meas. Tech.HTRF Assay
IC50 5.64±n/a nM
Citation Scott, WJLiu, NMöwes, MHägebarth, AMönning, UBömer, U Aminoalcohol substituted 2,3-dihydroimidazo[1,2-c]quinazoline derivatives useful for treating hyper-proliferative disorders and diseases associated with angiogenesis US Patent US8895549 Publication Date 11/25/2014
 
Phosphatidylinositol 4,5-bisphosphate 3-kinase catalytic subunit beta isoform
Name:Phosphatidylinositol 4,5-bisphosphate 3-kinase catalytic subunit beta isoform
Type:Enzyme Subunit
Mol. Mass.:122769.00
Organism:Homo sapiens (Human)
Description:P42338
Residue:1070
BDBM139748
NameBDBM139748
Synonyms:US8895549, 38
TypeSmall organic molecule
Emp. Form.C23H28N6O4S
Mol. Mass.484.571
SMILESCOc1c(OC[C@H](O)CN2CCCC2)ccc2C3=NCCN3C(NC(=O)c3scnc3C)=Nc12