Reaction Details
Target3-phosphoinositide-dependent protein kinase 1
LigandBDBM139798
Substrate/Competitorn/a
Meas. Tech.Kinase Assay
pH7.5±n/a
IC50 1±n/a nM
Commentsextracted
Citation McConnell, DEngelhardt, HKofink, C 1H-imidazo[4,5-c]quinolines US Patent US8895581 Publication Date 11/25/2014
 
3-phosphoinositide-dependent protein kinase 1
Name:3-phosphoinositide-dependent protein kinase 1
Type:Enzyme
Mol. Mass.:63157.65
Organism:Homo sapiens (Human)
Description:O15530
Residue:556
BDBM139798
NameBDBM139798
Synonyms:US8895581, II-19
TypeSmall organic molecule
Emp. Form.C30H26F2N6O3
Mol. Mass.556.5626
SMILESCOc1cc(C(=O)NCC#Cc2ccc3ncc4nc(C)n(C(C)C)c4c3c2)c(=O)n(Cc2ccc(F)c(F)c2)n1