Reaction Details
Target3-phosphoinositide-dependent protein kinase 1
LigandBDBM139820
Substrate/Competitorn/a
Meas. Tech.Kinase Assay
pH7.5±n/a
IC50 2±n/a nM
Commentsextracted
Citation McConnell, DEngelhardt, HKofink, C 1H-imidazo[4,5-c]quinolines US Patent US8895581 Publication Date 11/25/2014
 
3-phosphoinositide-dependent protein kinase 1
Name:3-phosphoinositide-dependent protein kinase 1
Type:Enzyme
Mol. Mass.:63157.65
Organism:Homo sapiens (Human)
Description:O15530
Residue:556
BDBM139820
NameBDBM139820
Synonyms:US8895581, III-6
TypeSmall organic molecule
Emp. Form.C34H32F2N6O2
Mol. Mass.594.6537
SMILESC[C@@H](c1ccc(F)c(F)c1)n1cccc(C(=O)NCC#Cc2ccc3ncc4nc(C)n(C5CCN(C)CC5)c4c3c2)c1=O