Reaction Details
Target3-phosphoinositide-dependent protein kinase 1
LigandBDBM139842
Substrate/Competitorn/a
Meas. Tech.Kinase Assay
pH7.5±n/a
IC50 2±n/a nM
Commentsextracted
Citation McConnell, DEngelhardt, HKofink, C 1H-imidazo[4,5-c]quinolines US Patent US8895581 Publication Date 11/25/2014
 
3-phosphoinositide-dependent protein kinase 1
Name:3-phosphoinositide-dependent protein kinase 1
Type:Enzyme
Mol. Mass.:63157.65
Organism:Homo sapiens (Human)
Description:O15530
Residue:556
BDBM139842
NameBDBM139842
Synonyms:US8895581, III-28
TypeSmall organic molecule
Emp. Form.C31H26F2N6O3
Mol. Mass.568.5733
SMILESCc1nc2cnc3ccc(cc3c2n1C1CCCOC1)C#CCNC(=O)c1cncn(Cc2ccc(F)c(F)c2)c1=O