Reaction Details
TargetRibosomal protein S6 kinase beta-1 [T412E]
LigandBDBM224498
Substrate/Competitorn/a
Meas. Tech.P70S6K Enzyme Assay
pH7.5±n/a
IC50 0.800±n/a nM
Commentsextracted
Citation Lan, RHuck, BRChen, XDeselm, LCQiu, HXiao, YNeagu, CMochalkin, IJohnson, TL Aminopyrimidine derivatives for use as modulators of kinase activity US Patent US10080750 Publication Date 9/25/2018
 
Ribosomal protein S6 kinase beta-1 [T412E]
Name:Ribosomal protein S6 kinase beta-1 [T412E]
Type:Enzyme Catalytic Domain
Mol. Mass.:59166.89
Organism:Homo sapiens (Human)
Description:P23443[T412E]
Residue:525
BDBM224498
NameBDBM224498
Synonyms:US10080750, Compound 176 US9662330, Compound 176
TypeSmall organic molecule
Emp. Form.C21H23ClFN7
Mol. Mass.427.906
SMILESNC[C@@H](N1CCN(CC1)c1ncnc(N)c1-c1ccc(F)cc1)c1ccc(Cl)nc1