Reaction Details
TargetProtein O-GlcNAcase
LigandBDBM139956
Substrate/Competitorn/a
Meas. Tech.Inhibition Assay
pH7±n/a
Temperature298.15±n/a K
Ki 0.82±n/a nM
Commentsextracted
Citation Chang, JLiu, KMcEachern, EJMu, CSelnick, HGShi, FVocadlo, DJWang, YWei, ZZhou, YZhu, Y Selective glycosidase inhibitors and uses thereof US Patent US8901087 Publication Date 12/2/2014
 
Protein O-GlcNAcase
Name:Protein O-GlcNAcase
Type:Enzyme
Mol. Mass.:102874.67
Organism:Homo sapiens (Human)
Description:O60502
Residue:916
BDBM139956
NameBDBM139956
Synonyms:US8901087, 141
TypeSmall organic molecule
Emp. Form.C10H17FN2O4S
Mol. Mass.280.316
SMILESC[C@H](O)[C@H]1O[C@@H]2SC(NCCF)=N[C@@H]2[C@@H](O)[C@@H]1O