Reaction Details
TargetProtein O-GlcNAcase
LigandBDBM139957
Substrate/Competitorn/a
Meas. Tech.Inhibition Assay
pH7±n/a
Temperature298.15±n/a K
Ki 1.25±n/a nM
Commentsextracted
Citation Chang, JLiu, KMcEachern, EJMu, CSelnick, HGShi, FVocadlo, DJWang, YWei, ZZhou, YZhu, Y Selective glycosidase inhibitors and uses thereof US Patent US8901087 Publication Date 12/2/2014
 
Protein O-GlcNAcase
Name:Protein O-GlcNAcase
Type:Enzyme
Mol. Mass.:102874.67
Organism:Homo sapiens (Human)
Description:O60502
Residue:916
BDBM139957
NameBDBM139957
Synonyms:US8901087, 159
TypeSmall organic molecule
Emp. Form.C10H15F3N2O4S
Mol. Mass.316.297
SMILESCNC1=N[C@H]2[C@H](O[C@@H]([C@@H](O)[C@@H]2O)C(C)(O)C(F)(F)F)S1