Reaction Details
TargetPeptidyl-prolyl cis-trans isomerase B
LigandBDBM140001
Substrate/Competitorn/a
Meas. Tech.Enzymatic Assay
pH7.8±n/a
Temperature293.15±n/a K
IC50 1200±n/a nM
Commentsextracted
Citation Guichou, JColliandre, LAhmed-Belkacem, HPawlotsky, J Inhibitors of cyclophilins and uses thereof US Patent US8901295 Publication Date 12/2/2014
 
Peptidyl-prolyl cis-trans isomerase B
Name:Peptidyl-prolyl cis-trans isomerase B
Type:Protein
Mol. Mass.:23751.82
Organism:Homo sapiens (Human)
Description:P23284
Residue:216
BDBM140001
NameBDBM140001
Synonyms:US8901295, F609
TypeSmall organic molecule
Emp. Form.C21H26N4O3
Mol. Mass.382.4561
SMILESCOc1ccccc1C1CCCN1C(=O)CNC(=O)NCc1ccc(N)cc1