Reaction Details
TargetInterleukin-6
LigandBDBM140013
Substrate/Competitorn/a
Meas. Tech.Fluorescence Polarization Ligand Binding Assay
IC50 1.1±n/a nM
Citation Rucker, PVSnyder, JS Tricyclic compounds, compositions, and methods US Patent US8901310 Publication Date 12/2/2014
 
Interleukin-6
Name:Interleukin-6
Type:n/a
Mol. Mass.:23717.96
Organism:Homo sapiens (Human)
Description:P05231
Residue:212
BDBM140013
NameBDBM140013
Synonyms:US8901310, Comparator C
TypeSmall organic molecule
Emp. Form.C31H33F3N2O2
Mol. Mass.522.6011
SMILESCc1ncccc1NC(=O)c1ccc2c(CC[C@@H]3C[C@@](O)(CCC(F)(F)F)CC[C@@]23Cc2ccccc2)c1