Reaction Details
TargetGlucocorticoid receptor
LigandBDBM140014
Substrate/Competitorn/a
Meas. Tech.Fluorescence Polarization Ligand Binding Assay
IC50 2.06±n/a nM
Citation Rucker, PVSnyder, JS Tricyclic compounds, compositions, and methods US Patent US8901310 Publication Date 12/2/2014
 
Glucocorticoid receptor
Name:Glucocorticoid receptor
Type:Enzyme
Mol. Mass.:85656.87
Organism:Homo sapiens (Human)
Description:P04150
Residue:777
BDBM140014
NameBDBM140014
Synonyms:US8901310, Comparator D
TypeSmall organic molecule
Emp. Form.C29H29F3N2O2
Mol. Mass.494.548
SMILESCc1ccncc1NC(=O)c1ccc2c(CC[C@@H]3C[C@](O)(CC[C@@]23Cc2ccccc2)C(F)(F)F)c1