Reaction Details
TargetGlucocorticoid receptor
LigandBDBM140017
Substrate/Competitorn/a
Meas. Tech.Fluorescence Polarization Ligand Binding Assay
IC50 2.13±n/a nM
Citation Rucker, PVSnyder, JS Tricyclic compounds, compositions, and methods US Patent US8901310 Publication Date 12/2/2014
 
Glucocorticoid receptor
Name:Glucocorticoid receptor
Type:Enzyme
Mol. Mass.:85656.87
Organism:Homo sapiens (Human)
Description:P04150
Residue:777
BDBM140017
NameBDBM140017
Synonyms:US8901310, Comparator G
TypeSmall organic molecule
Emp. Form.C29H29F3N2O3
Mol. Mass.510.5474
SMILESCc1c(NC(=O)c2ccc3c(CC[C@@H]4C[C@](O)(CC[C@@]34Cc3ccccc3)C(F)(F)F)c2)ccc[n+]1[O-]