Reaction Details
TargetGlucocorticoid receptor
LigandBDBM140020
Substrate/Competitorn/a
Meas. Tech.Fluorescence Polarization Ligand Binding Assay
IC50 4.58±n/a nM
Citation Rucker, PVSnyder, JS Tricyclic compounds, compositions, and methods US Patent US8901310 Publication Date 12/2/2014
 
Glucocorticoid receptor
Name:Glucocorticoid receptor
Type:Enzyme
Mol. Mass.:85656.87
Organism:Homo sapiens (Human)
Description:P04150
Residue:777
BDBM140020
NameBDBM140020
Synonyms:US8901310, Comparator J
TypeSmall organic molecule
Emp. Form.C31H34F3N3O2
Mol. Mass.537.6158
SMILESCc1ncc(NC(=O)c2ccc3c(CC[C@@H]4C[C@@](O)(CCC(F)(F)F)CC[C@@]34Cc3ccccc3)c2)c(C)n1