Reaction Details
TargetPhosphodiesterase
LigandBDBM140070
Substrate/Competitorn/a
Meas. Tech.Inhibition Assay
pH6.5±n/a
Temperature277.15±n/a K
IC50 1500±n/a nM
Commentsextracted
Citation Inoue, HMurafuji, HHayashi, Y Thienopyrazole derivative having PDE7 inhibitory activity US Patent US8901315 Publication Date 12/2/2014
 
Phosphodiesterase
Name:Phosphodiesterase
Synonyms:Phosphodiesterase 4 (PDE4)
Type:Protein
Mol. Mass.:82059.36
Organism:Mus musculus (Mouse)
Description:Q8VBU5
Residue:721
BDBM140070
NameBDBM140070
Synonyms:US8901315, 115
TypeSmall organic molecule
Emp. Form.C23H28N4O3S
Mol. Mass.440.558
SMILESCOc1cc(NC(=O)c2cc3c(C)nn(C4CCCCCC4)c3s2)ccc1NC(C)=O