Reaction Details
TargetPhosphodiesterase
LigandBDBM140096
Substrate/Competitorn/a
Meas. Tech.Inhibition Assay
pH6.5±n/a
Temperature277.15±n/a K
IC50 1400±n/a nM
Commentsextracted
Citation Inoue, HMurafuji, HHayashi, Y Thienopyrazole derivative having PDE7 inhibitory activity US Patent US8901315 Publication Date 12/2/2014
 
Phosphodiesterase
Name:Phosphodiesterase
Synonyms:Phosphodiesterase 4 (PDE4)
Type:Protein
Mol. Mass.:82059.36
Organism:Mus musculus (Mouse)
Description:Q8VBU5
Residue:721
BDBM140096
NameBDBM140096
Synonyms:US8901315, 180
TypeSmall organic molecule
Emp. Form.C27H41N5O2S
Mol. Mass.499.712
SMILESCN(C1CCN(CC1)[C@H]1CC[C@@H](CC1)NC(=O)c1cc2c(C)nn(C3CCCCC3)c2s1)C(C)=O