Reaction Details
TargetPhosphodiesterase
LigandBDBM140097
Substrate/Competitorn/a
Meas. Tech.Inhibition Assay
pH6.5±n/a
Temperature277.15±n/a K
IC50 860±n/a nM
Commentsextracted
Citation Inoue, HMurafuji, HHayashi, Y Thienopyrazole derivative having PDE7 inhibitory activity US Patent US8901315 Publication Date 12/2/2014
 
Phosphodiesterase
Name:Phosphodiesterase
Synonyms:Phosphodiesterase 4 (PDE4)
Type:Protein
Mol. Mass.:82059.36
Organism:Mus musculus (Mouse)
Description:Q8VBU5
Residue:721
BDBM140097
NameBDBM140097
Synonyms:US8901315, 181
TypeSmall organic molecule
Emp. Form.C26H41N5OS
Mol. Mass.471.702
SMILESCN(C)C1CCN(CC1)[C@H]1CC[C@@H](CC1)NC(=O)c1cc2c(C)nn(C3CCCCC3)c2s1