Reaction Details
TargetPhosphodiesterase
LigandBDBM140105
Substrate/Competitorn/a
Meas. Tech.Inhibition Assay
pH6.5±n/a
Temperature277.15±n/a K
IC50 1900±n/a nM
Commentsextracted
Citation Inoue, HMurafuji, HHayashi, Y Thienopyrazole derivative having PDE7 inhibitory activity US Patent US8901315 Publication Date 12/2/2014
 
Phosphodiesterase
Name:Phosphodiesterase
Synonyms:Phosphodiesterase 4 (PDE4)
Type:Protein
Mol. Mass.:82059.36
Organism:Mus musculus (Mouse)
Description:Q8VBU5
Residue:721
BDBM140105
NameBDBM140105
Synonyms:US8901315, 200
TypeSmall organic molecule
Emp. Form.C23H30N4OS
Mol. Mass.410.576
SMILESCN(C)CCc1ccc(NC(=O)c2cc3c(C)nn(C4CCCCC4)c3s2)cc1