Reaction Details
TargetPhosphodiesterase
LigandBDBM140172
Substrate/Competitorn/a
Meas. Tech.Inhibition Assay
pH6.5±n/a
Temperature277.15±n/a K
IC50 1500±n/a nM
Commentsextracted
Citation Inoue, HMurafuji, HHayashi, Y Thienopyrazole derivative having PDE7 inhibitory activity US Patent US8901315 Publication Date 12/2/2014
 
Phosphodiesterase
Name:Phosphodiesterase
Synonyms:Phosphodiesterase 4 (PDE4)
Type:Protein
Mol. Mass.:82059.36
Organism:Mus musculus (Mouse)
Description:Q8VBU5
Residue:721
BDBM140172
NameBDBM140172
Synonyms:US8901315, 380
TypeSmall organic molecule
Emp. Form.C24H30N6O2S
Mol. Mass.466.599
SMILESCN1CCN(CC1)C(=O)c1ccc(NC(=O)c2cc3c(C)nn(C4CCCCC4)c3s2)cn1