Reaction Details
TargetPhosphodiesterase
LigandBDBM140173
Substrate/Competitorn/a
Meas. Tech.Inhibition Assay
pH6.5±n/a
Temperature277.15±n/a K
IC50 670±n/a nM
Commentsextracted
Citation Inoue, HMurafuji, HHayashi, Y Thienopyrazole derivative having PDE7 inhibitory activity US Patent US8901315 Publication Date 12/2/2014
 
Phosphodiesterase
Name:Phosphodiesterase
Synonyms:Phosphodiesterase 4 (PDE4)
Type:Protein
Mol. Mass.:82059.36
Organism:Mus musculus (Mouse)
Description:Q8VBU5
Residue:721
BDBM140173
NameBDBM140173
Synonyms:US8901315, 381
TypeSmall organic molecule
Emp. Form.C23H30N6O2S
Mol. Mass.454.588
SMILESCN(C)CCNC(=O)c1ccc(NC(=O)c2cc3c(C)nn(C4CCCCC4)c3s2)cn1