Reaction Details
TargetPhosphodiesterase
LigandBDBM140177
Substrate/Competitorn/a
Meas. Tech.Inhibition Assay
pH6.5±n/a
Temperature277.15±n/a K
IC50 900±n/a nM
Commentsextracted
Citation Inoue, HMurafuji, HHayashi, Y Thienopyrazole derivative having PDE7 inhibitory activity US Patent US8901315 Publication Date 12/2/2014
 
Phosphodiesterase
Name:Phosphodiesterase
Synonyms:Phosphodiesterase 4 (PDE4)
Type:Protein
Mol. Mass.:82059.36
Organism:Mus musculus (Mouse)
Description:Q8VBU5
Residue:721
BDBM140177
NameBDBM140177
Synonyms:US8901315, 396
TypeSmall organic molecule
Emp. Form.C23H35N5O4S2
Mol. Mass.509.685
SMILESCc1nn(C2CCOCC2)c2sc(cc12)C(=O)N[C@H]1CC[C@@H](CC1)N1CCN(CC1)S(C)(=O)=O