Reaction Details
TargetLysosomal acid glucosylceramidase
LigandBDBM285820
Substrate/Competitorn/a
Meas. Tech.Assay for Determination of Ki Values for Inhibition of GCase Activity
pH7±n/a
Ki 7.00±n/a nM
Commentsextracted
Citation Kaul, RMcEachern, EJSun, JVocadlo, DJZhou, YZhu, Y Glucocerebrosidase modulators and uses thereof US Patent US10081601 Publication Date 9/25/2018
 
Lysosomal acid glucosylceramidase
Name:Lysosomal acid glucosylceramidase
Type:Enzyme
Mol. Mass.:59724.64
Organism:Homo sapiens (Human)
Description:The beta-Glu activity was measured with commercially available beta-glucocerebrosidase (Ceredase) as the enzyme source.
Residue:536
BDBM285820
NameBDBM285820
Synonyms:(6R,7R,8R)-8-(hydroxymethyl)-4-azaspiro[2.5]octane-6,7-diol US9796680, Example 2
TypeSmall organic molecule
Emp. Form.C8H15NO3
Mol. Mass.173.2096
SMILESOC[C@@H]1[C@@H](O)[C@H](O)CNC11CC1