Reaction Details
TargetTyrosine-protein kinase SYK
LigandBDBM140381
Substrate/Competitorn/a
Meas. Tech.Kinase Assay
pH7.5±n/a
Temperature193.15±n/a K
IC50 1.3±n/a nM
Citation Hoffmann, MBischoff, DDahmann, GKlicic, JSchaenzle, GWollin, SLConvers-Reignier, SGEast, SPMarlin, FJMcCarthy, CScott, J Substituted quinolines and their use as medicaments US Patent US8912173 Publication Date 12/16/2014
 
Tyrosine-protein kinase SYK
Name:Tyrosine-protein kinase SYK
Type:Enzyme
Mol. Mass.:72079.99
Organism:Homo sapiens (Human)
Description:P43405
Residue:635
BDBM140381
NameBDBM140381
Synonyms:US8912173, 106
TypeSmall organic molecule
Emp. Form.C25H21N5O2
Mol. Mass.423.4665
SMILESCc1nc2cc(ccc2n1C)-c1cc(OCc2ncccc2C(N)=O)c2cccnc2c1