Reaction Details
TargetTyrosine-protein kinase SYK
LigandBDBM140384
Substrate/Competitorn/a
Meas. Tech.Kinase Assay
pH7.5±n/a
Temperature193.15±n/a K
IC50 0.4±n/a nM
Citation Hoffmann, MBischoff, DDahmann, GKlicic, JSchaenzle, GWollin, SLConvers-Reignier, SGEast, SPMarlin, FJMcCarthy, CScott, J Substituted quinolines and their use as medicaments US Patent US8912173 Publication Date 12/16/2014
 
Tyrosine-protein kinase SYK
Name:Tyrosine-protein kinase SYK
Type:Enzyme
Mol. Mass.:72079.99
Organism:Homo sapiens (Human)
Description:P43405
Residue:635
BDBM140384
NameBDBM140384
Synonyms:US10947243, Example 109 US9914735, Example 109
TypeSmall organic molecule
Emp. Form.C23H22N4O2
Mol. Mass.386.4464
SMILESC[C@@H](Oc1cc(cc2ncccc12)-c1ccc2[nH]c(C)nc2c1)[C@H]1CNC(=O)C1