Reaction Details
TargetTyrosine-protein kinase SYK
LigandBDBM140314
Substrate/Competitorn/a
Meas. Tech.Kinase Assay
pH7.5±n/a
Temperature193.15±n/a K
IC50 3.4±n/a nM
Citation Hoffmann, MBischoff, DDahmann, GKlicic, JSchaenzle, GWollin, SLConvers-Reignier, SGEast, SPMarlin, FJMcCarthy, CScott, J Substituted quinolines and their use as medicaments US Patent US8912173 Publication Date 12/16/2014
 
Tyrosine-protein kinase SYK
Name:Tyrosine-protein kinase SYK
Type:Enzyme
Mol. Mass.:72079.99
Organism:Homo sapiens (Human)
Description:P43405
Residue:635
BDBM140314
NameBDBM140314
Synonyms:US8912173, 40
TypeSmall organic molecule
Emp. Form.C27H26N4O3
Mol. Mass.454.5203
SMILESNC(=O)c1cccnc1COc1cc(cc2ncccc12)-c1ccc(CN2CCOCC2)cc1