Reaction Details
TargetMuscarinic acetylcholine receptor M3
LigandBDBM103760
Substrate/Competitorn/a
Meas. Tech.Radioligand Binding Assay
Ki 0.10±n/a nM
Citation Hughes, ADByun, DChen, YFleury, MJacobsen, JRStangeland, ELWilson, RDYen, R Diamide compounds having muscarinic receptor antagonist and β2 adrenergic receptor agonist activity US Patent US9682957 Publication Date 6/20/2017
 
Muscarinic acetylcholine receptor M3
Name:Muscarinic acetylcholine receptor M3
Type:Enzyme
Mol. Mass.:66151.03
Organism:Homo sapiens (Human)
Description:P20309
Residue:590
BDBM103760
NameBDBM103760
Synonyms:US8551978, I-29 US9394275, I-29 US9682957, I-29
TypeSmall organic molecule
Emp. Form.C48H50N6O8
Mol. Mass.838.946
SMILESCOc1cc(CNC[C@H](O)c2ccc(O)c3[nH]c(=O)ccc23)ccc1NC(=O)c1cccc(c1)N(C)C(=O)CCN1CCC(CC1)OC(=O)Nc1ccccc1-c1ccccc1