Reaction Details
TargetMuscarinic acetylcholine receptor M3
LigandBDBM103763
Substrate/Competitorn/a
Meas. Tech.Radioligand Binding Assay
Ki 0.10±n/a nM
Citation Hughes, ADByun, DChen, YFleury, MJacobsen, JRStangeland, ELWilson, RDYen, R Diamide compounds having muscarinic receptor antagonist and β2 adrenergic receptor agonist activity US Patent US9682957 Publication Date 6/20/2017
 
Muscarinic acetylcholine receptor M3
Name:Muscarinic acetylcholine receptor M3
Type:Enzyme
Mol. Mass.:66151.03
Organism:Homo sapiens (Human)
Description:P20309
Residue:590
BDBM103763
NameBDBM103763
Synonyms:US8551978, I-32 US9394275, I-32 US9682957, I-32
TypeSmall organic molecule
Emp. Form.C48H50N6O7
Mol. Mass.822.9466
SMILESCN(C(=O)CCN1CCC(CC1)OC(=O)Nc1ccccc1-c1ccccc1)c1cccc(c1)C(=O)Nc1cccc(CCNC[C@H](O)c2ccc(O)c3[nH]c(=O)ccc23)c1