Reaction Details
TargetMuscarinic acetylcholine receptor M3
LigandBDBM103770
Substrate/Competitorn/a
Meas. Tech.Radioligand Binding Assay
Ki 0.10±n/a nM
Citation Hughes, ADByun, DChen, YFleury, MJacobsen, JRStangeland, ELWilson, RDYen, R Diamide compounds having muscarinic receptor antagonist and β2 adrenergic receptor agonist activity US Patent US9682957 Publication Date 6/20/2017
 
Muscarinic acetylcholine receptor M3
Name:Muscarinic acetylcholine receptor M3
Type:Enzyme
Mol. Mass.:66151.03
Organism:Homo sapiens (Human)
Description:P20309
Residue:590
BDBM103770
NameBDBM103770
Synonyms:US8551978, I-40 US9394275, I-40 US9682957, I-40
TypeSmall organic molecule
Emp. Form.C49H52N6O7
Mol. Mass.836.9732
SMILESCC(Cc1ccc(NC(=O)c2cccc(c2)N(C)C(=O)CCN2CCC(CC2)OC(=O)Nc2ccccc2-c2ccccc2)cc1)NC[C@H](O)c1ccc(O)c2[nH]c(=O)ccc12