Reaction Details
TargetMuscarinic acetylcholine receptor M3
LigandBDBM103779
Substrate/Competitorn/a
Meas. Tech.Radioligand Binding Assay
Ki 0.10±n/a nM
Citation Hughes, ADByun, DChen, YFleury, MJacobsen, JRStangeland, ELWilson, RDYen, R Diamide compounds having muscarinic receptor antagonist and β2 adrenergic receptor agonist activity US Patent US9682957 Publication Date 6/20/2017
 
Muscarinic acetylcholine receptor M3
Name:Muscarinic acetylcholine receptor M3
Type:Enzyme
Mol. Mass.:66151.03
Organism:Homo sapiens (Human)
Description:P20309
Residue:590
BDBM103779
NameBDBM103779
Synonyms:US8551978, I-49 US9394275, I-49 US9682957, I-49
TypeSmall organic molecule
Emp. Form.C50H54N6O7
Mol. Mass.850.9998
SMILESC[C@@H](Cc1ccc(CNC(=O)c2cccc(c2)N(C)C(=O)CCN2CCC(CC2)OC(=O)Nc2ccccc2-c2ccccc2)cc1)NC[C@H](O)c1ccc(O)c2[nH]c(=O)ccc12