Reaction Details
TargetRho-associated protein kinase 2
LigandBDBM141022
Substrate/Competitorn/a
Meas. Tech.Binding Assay
IC50>3000±n/a nM
Citation Bartolozzi, ACampbell, SFoudoulakis, HKirk, BRam, SSweetnam, PSeshadri, H Pharmacokinetically improved compounds US Patent US8916576 Publication Date 12/23/2014
 
Rho-associated protein kinase 2
Name:Rho-associated protein kinase 2
Type:Protein
Mol. Mass.:160885.43
Organism:Homo sapiens (Human)
Description:O75116
Residue:1388
BDBM141022
NameBDBM141022
Synonyms:US10570123, Example 231 | US8916576, 231
TypeSmall organic molecule
Emp. Form.C27H25N7O2
Mol. Mass.479.5331
SMILESO=C(CN1CCOCC1)Nc1ccccc1-c1nc(Nc2ccc3[nH]ncc3c2)c2ccccc2n1