Reaction Details
TargetRho-associated protein kinase 2
LigandBDBM140999
Substrate/Competitorn/a
Meas. Tech.Binding Assay
IC50 12±n/a nM
Citation Bartolozzi, ACampbell, SFoudoulakis, HKirk, BRam, SSweetnam, PSeshadri, H Pharmacokinetically improved compounds US Patent US8916576 Publication Date 12/23/2014
 
Rho-associated protein kinase 2
Name:Rho-associated protein kinase 2
Type:Protein
Mol. Mass.:160885.43
Organism:Homo sapiens (Human)
Description:O75116
Residue:1388
BDBM140999
NameBDBM140999
Synonyms:US10570123, Example 203 | US8916576, 203
TypeSmall organic molecule
Emp. Form.C32H36N8O2
Mol. Mass.564.6806
SMILESCCCC(=O)Nc1cccc(c1)-c1nc(Nc2ccc3[nH]ncc3c2)c2cc(OCCN3CCN(C)CC3)ccc2n1