Reaction Details
TargetRho-associated protein kinase 2
LigandBDBM141002
Substrate/Competitorn/a
Meas. Tech.Binding Assay
IC50 48±n/a nM
Citation Bartolozzi, ACampbell, SFoudoulakis, HKirk, BRam, SSweetnam, PSeshadri, H Pharmacokinetically improved compounds US Patent US8916576 Publication Date 12/23/2014
 
Rho-associated protein kinase 2
Name:Rho-associated protein kinase 2
Type:Protein
Mol. Mass.:160885.43
Organism:Homo sapiens (Human)
Description:O75116
Residue:1388
BDBM141002
NameBDBM141002
Synonyms:US10570123, Example 206 | US8916576, 206
TypeSmall organic molecule
Emp. Form.C32H33N7O4
Mol. Mass.579.6489
SMILESCCCC(=O)Nc1cccc(c1)-c1nc(Nc2ccc3[nH]ncc3c2)c2cc(OCCN3CCCC3=O)c(OC)cc2n1