Reaction Details
TargetRho-associated protein kinase 2
LigandBDBM141005
Substrate/Competitorn/a
Meas. Tech.Binding Assay
IC50 18±n/a nM
Citation Bartolozzi, ACampbell, SFoudoulakis, HKirk, BRam, SSweetnam, PSeshadri, H Pharmacokinetically improved compounds US Patent US8916576 Publication Date 12/23/2014
 
Rho-associated protein kinase 2
Name:Rho-associated protein kinase 2
Type:Protein
Mol. Mass.:160885.43
Organism:Homo sapiens (Human)
Description:O75116
Residue:1388
BDBM141005
NameBDBM141005
Synonyms:US10570123, Example 210 | US8916576, 210
TypeSmall organic molecule
Emp. Form.C34H40N8O3
Mol. Mass.608.7332
SMILESCCCC(=O)Nc1cccc(c1)-c1nc(Nc2ccc3[nH]ncc3c2)c2cc(OCCN3CC[C@@H](C3)N(C)C)c(OC)cc2n1