Reaction Details
TargetRho-associated protein kinase 2
LigandBDBM141036
Substrate/Competitorn/a
Meas. Tech.Binding Assay
IC50 24±n/a nM
Citation Bartolozzi, ACampbell, SFoudoulakis, HKirk, BRam, SSweetnam, PSeshadri, H Pharmacokinetically improved compounds US Patent US8916576 Publication Date 12/23/2014
 
Rho-associated protein kinase 2
Name:Rho-associated protein kinase 2
Type:Protein
Mol. Mass.:160885.43
Organism:Homo sapiens (Human)
Description:O75116
Residue:1388
BDBM141036
NameBDBM141036
Synonyms:US10570123, Example 262 | US8916576, 262
TypeSmall organic molecule
Emp. Form.C29H30N6O4
Mol. Mass.526.5863
SMILESCCCC(=O)Nc1cccc(c1)-c1nc(Nc2ccc3[nH]ncc3c2)c2cc(OC)c(OCCOC)cc2n1