Reaction Details
TargetPlasminogen
LigandBDBM141388
Substrate/Competitorn/a
Meas. Tech.Enzyme Assay
pH8±n/a
Ki 20.3±n/a nM
Commentsextracted
Citation Steinmetzer, TSaupe, SM Serine protease inhibitors US Patent US8921319 Publication Date 12/30/2014
 
Plasminogen
Name:Plasminogen
Type:Enzyme
Mol. Mass.:90579.18
Organism:Homo sapiens (Human)
Description:n/a
Residue:810
BDBM141388
NameBDBM141388
Synonyms:US8921319, 7
TypeSmall organic molecule
Emp. Form.C45H47N7O6S
Mol. Mass.813.963
SMILESNC(=N)c1ccc(CNC(=O)[C@@H]2Cc3cccc(CNC(=O)Cc4ccccc4CC(=O)NCc4cccc(C[C@@H](NS(=O)(=O)Cc5ccccc5)C(=O)N2)c4)c3)cc1