Reaction Details
TargetPlasminogen
LigandBDBM141389
Substrate/Competitorn/a
Meas. Tech.Enzyme Assay
pH8±n/a
Ki 2.5±n/a nM
Commentsextracted
Citation Steinmetzer, TSaupe, SM Serine protease inhibitors US Patent US8921319 Publication Date 12/30/2014
 
Plasminogen
Name:Plasminogen
Type:Enzyme
Mol. Mass.:90579.18
Organism:Homo sapiens (Human)
Description:n/a
Residue:810
BDBM141389
NameBDBM141389
Synonyms:US8921319, 10
TypeSmall organic molecule
Emp. Form.C37H39N5O6S
Mol. Mass.681.8
SMILESNC(=N)c1ccc(CNC(=O)[C@@H]2Cc3ccc(OC\C=C/COc4ccc(C[C@@H](NS(=O)(=O)Cc5ccccc5)C(=O)N2)cc4)cc3)cc1