Reaction Details
TargetCoagulation factor X
LigandBDBM50380623
Substrate/Competitorn/a
Meas. Tech.Enzyme Assay
pH8±n/a
Ki 42.1±n/a nM
Commentsextracted
Citation Steinmetzer, TSaupe, SM Serine protease inhibitors US Patent US8921319 Publication Date 12/30/2014
 
Coagulation factor X
Name:Coagulation factor X
Type:Enzyme
Mol. Mass.:54726.60
Organism:Homo sapiens (Human)
Description:n/a
Residue:488
BDBM50380623
NameBDBM50380623
Synonyms:CHEMBL2016870
TypeSmall organic molecule
Emp. Form.C45H47N7O6S
Mol. Mass.813.963
SMILESNC(=N)c1ccc(CNC(=O)[C@@H]2Cc3cccc(CNC(=O)Cc4cccc(CC(=O)NCc5cccc(C[C@@H](NS(=O)(=O)Cc6ccccc6)C(=O)N2)c5)c4)c3)cc1