Reaction Details
TargetCoagulation factor X
LigandBDBM141390
Substrate/Competitorn/a
Meas. Tech.Enzyme Assay
pH8±n/a
Ki 376±n/a nM
Commentsextracted
Citation Steinmetzer, TSaupe, SM Serine protease inhibitors US Patent US8921319 Publication Date 12/30/2014
 
Coagulation factor X
Name:Coagulation factor X
Type:Enzyme
Mol. Mass.:54726.60
Organism:Homo sapiens (Human)
Description:n/a
Residue:488
BDBM141390
NameBDBM141390
Synonyms:US8921319, 12
TypeSmall organic molecule
Emp. Form.C35H43N7O6S
Mol. Mass.689.824
SMILESNC(=N)c1ccc(CNC(=O)[C@@H]2CCCCNC(=O)c3cccc(c3)C(=O)NCCCC[C@@H](NS(=O)(=O)Cc3ccccc3)C(=O)N2)cc1