Reaction Details
TargetEF-hand calcium-binding domain-containing protein 4B
LigandBDBM141415
Substrate/Competitorn/a
Meas. Tech.In-Vitro Inhibition Assay
Temperature310.15±n/a K
IC50 254.7±n/a nM
Commentsextracted
Citation Muthuppalaniappan, MViswanadha, SMerikapudi, GSVakkalanka, SK Modulators of calcium release-activated calcium channel US Patent US8921364 Publication Date 12/30/2014
 
EF-hand calcium-binding domain-containing protein 4B
Name:EF-hand calcium-binding domain-containing protein 4B
Type:Protein
Mol. Mass.:45570.29
Organism:Homo sapiens (Human)
Description:Q9BSW2
Residue:395
BDBM141415
NameBDBM141415
Synonyms:US10668051, Compound Example 66 | US8921364, 66
TypeSmall organic molecule
Emp. Form.C19H15F3N4O
Mol. Mass.372.3438
SMILESFC(F)(F)c1cc(C2CC2)n(n1)-c1ccc(NC(=O)c2ccncc2)cc1