Reaction Details
TargetEF-hand calcium-binding domain-containing protein 4B
LigandBDBM141419
Substrate/Competitorn/a
Meas. Tech.In-Vitro Inhibition Assay
Temperature310.15±n/a K
IC50 48.02±n/a nM
Commentsextracted
Citation Muthuppalaniappan, MViswanadha, SMerikapudi, GSVakkalanka, SK Modulators of calcium release-activated calcium channel US Patent US8921364 Publication Date 12/30/2014
 
EF-hand calcium-binding domain-containing protein 4B
Name:EF-hand calcium-binding domain-containing protein 4B
Type:Protein
Mol. Mass.:45570.29
Organism:Homo sapiens (Human)
Description:Q9BSW2
Residue:395
BDBM141419
NameBDBM141419
Synonyms:US10668051, Compound Example 74 | US8921364, 74
TypeSmall organic molecule
Emp. Form.C18H17F3N4S
Mol. Mass.378.415
SMILESCc1ncsc1CNc1ccc(cc1)-n1nc(cc1C1CC1)C(F)(F)F