Reaction Details
TargetEF-hand calcium-binding domain-containing protein 4B
LigandBDBM141426
Substrate/Competitorn/a
Meas. Tech.In-Vitro Inhibition Assay
Temperature310.15±n/a K
IC50 20.79±n/a nM
Commentsextracted
Citation Muthuppalaniappan, MViswanadha, SMerikapudi, GSVakkalanka, SK Modulators of calcium release-activated calcium channel US Patent US8921364 Publication Date 12/30/2014
 
EF-hand calcium-binding domain-containing protein 4B
Name:EF-hand calcium-binding domain-containing protein 4B
Type:Protein
Mol. Mass.:45570.29
Organism:Homo sapiens (Human)
Description:Q9BSW2
Residue:395
BDBM141426
NameBDBM141426
Synonyms:US10668051, Compound Example 84 | US8921364, 84
TypeSmall organic molecule
Emp. Form.C18H14F4N4O2
Mol. Mass.394.323
SMILESCc1oncc1C(=O)Nc1ccc(c(F)c1)-n1nc(cc1C1CC1)C(F)(F)F