Reaction Details
TargetTyrosine-protein kinase JAK3
LigandBDBM141456
Substrate/Competitorn/a
Meas. Tech.Kinase Assay
pH8±n/a
Temperature298.15±n/a K
IC50 0.3±n/a nM
Commentsextracted
Citation Wrobleski, STBrown, GDDoweyko, LMDuan, JGuo, JHynes, JJiang, BKempson, JLin, SLu, ZSpergel, SHTokarski, JSWu, HYang, BV Pyrrolopyridazine JAK3 inhibitors and their use for the treatment of inflammatory and autoimmune diseases US Patent US8921368 Publication Date 12/30/2014
 
Tyrosine-protein kinase JAK3
Name:Tyrosine-protein kinase JAK3
Type:Protein
Mol. Mass.:125111.08
Organism:Homo sapiens (Human)
Description:P52333
Residue:1124
BDBM141456
NameBDBM141456
Synonyms:US8921368, 72
TypeSmall organic molecule
Emp. Form.C21H23FN4O
Mol. Mass.366.4319
SMILESCc1cccc(c1)-c1cc2c(N[C@@H]3CCC[C@]3(C)F)c(cnn2c1)C(N)=O