Reaction Details
TargetTyrosine-protein kinase JAK3
LigandBDBM141485
Substrate/Competitorn/a
Meas. Tech.Kinase Assay
pH8±n/a
Temperature298.15±n/a K
IC50 0.2±n/a nM
Commentsextracted
Citation Wrobleski, STBrown, GDDoweyko, LMDuan, JGuo, JHynes, JJiang, BKempson, JLin, SLu, ZSpergel, SHTokarski, JSWu, HYang, BV Pyrrolopyridazine JAK3 inhibitors and their use for the treatment of inflammatory and autoimmune diseases US Patent US8921368 Publication Date 12/30/2014
 
Tyrosine-protein kinase JAK3
Name:Tyrosine-protein kinase JAK3
Type:Protein
Mol. Mass.:125111.08
Organism:Homo sapiens (Human)
Description:P52333
Residue:1124
BDBM141485
NameBDBM141485
Synonyms:US8921368, 293
TypeSmall organic molecule
Emp. Form.C22H26N4O2
Mol. Mass.378.4674
SMILESC[C@@]1(O)CC[C@@H](Nc2c(cnn3cc(cc23)-c2ccccc2)C(N)=O)C1(C)C