Reaction Details
TargetMetabotropic glutamate receptor 5
LigandBDBM141502
Substrate/Competitorn/a
Meas. Tech.Calcium Mobilization Assay
pH7.4±n/a
Temperature310.15±n/a K
IC50 9±n/a nM
Commentsextracted
Citation Li, GZhou, HWeiss, JDoller, DBurns, JF Bicyclo[3.2.1]octyl amide derivatives and uses of same US Patent US8921370 Publication Date 12/30/2014
 
Metabotropic glutamate receptor 5
Name:Metabotropic glutamate receptor 5
Type:Enzyme
Mol. Mass.:132484.72
Organism:Homo sapiens (Human)
Description:n/a
Residue:1212
BDBM141502
NameBDBM141502
Synonyms:US8921370, 6 | US9656975, 6
TypeSmall organic molecule
Emp. Form.C21H23FN4O2
Mol. Mass.382.4313
SMILESCc1cncc(n1)C(=O)NC12CCC(C1)(CCC2)NC(=O)c1cccc(F)c1