Reaction Details
TargetMetabotropic glutamate receptor 5
LigandBDBM141508
Substrate/Competitorn/a
Meas. Tech.Calcium Mobilization Assay
pH7.4±n/a
Temperature310.15±n/a K
IC50 4.7±n/a nM
Commentsextracted
Citation Li, GZhou, HWeiss, JDoller, DBurns, JF Bicyclo[3.2.1]octyl amide derivatives and uses of same US Patent US8921370 Publication Date 12/30/2014
 
Metabotropic glutamate receptor 5
Name:Metabotropic glutamate receptor 5
Type:Enzyme
Mol. Mass.:132484.72
Organism:Homo sapiens (Human)
Description:n/a
Residue:1212
BDBM141508
NameBDBM141508
Synonyms:US8921370, 171 | US9656975, 171
TypeSmall organic molecule
Emp. Form.C20H24N4O2S
Mol. Mass.384.495
SMILESCc1csc(n1)C(=O)NC12CCC(C1)(CCC2)C(=O)Nc1cccc(C)n1